root@turris:~/kernel/openwrt$ make configure
Checking 'working-make'... ok.
Checking 'case-sensitive-fs'... ok.
Checking 'proper-umask'... ok.
Checking 'gcc'... ok.
Checking 'working-gcc'... ok.
Checking 'g++'... ok.
Checking 'working-g++'... ok.
Checking 'ncurses'... failed.
Checking 'perl-data-dumper'... ok.
Checking 'perl-thread-queue'... ok.
Checking 'tar'... ok.
Checking 'find'... ok.
Checking 'bash'... ok.
Checking 'xargs'... ok.
Checking 'patch'... ok.
Checking 'diff'... ok.
Checking 'cp'... ok.
Checking 'seq'... ok.
Checking 'awk'... ok.
Checking 'grep'... ok.
Checking 'egrep'... ok.
Checking 'getopt'... ok.
Checking 'stat'... ok.
Checking 'unzip'... ok.
Checking 'bzip2'... ok.
Checking 'wget'... ok.
Checking 'perl'... ok.
Checking 'python2-cleanup'... ok.
Checking 'python'... ok.
Checking 'python3'... ok.
Checking 'git'... ok.
Checking 'file'... ok.
Checking 'rsync'... ok.
Prerequisite check failed. Use FORCE=1 to override.
make[2]: *** [/root/kernel/openwrt/include/toplevel.mk:180: staging_dir/host/.prereq-build] Error 1
make[1]: *** [/root/kernel/openwrt/include/toplevel.mk:77: prepare-tmpinfo] Error 2
make: *** [/root/kernel/openwrt/include/toplevel.mk:228: configure] Error 2

Vloženo: jos.sk @ 5:42:44 PM, 2021/02/21